CompanyName,Address1,Address2,Address3,Address4,Address5,PostCode,CommodityCode,HS2Description,CN8Description,TradeTypeDescription,Month,Year
5 WEST LIMITED,UNIT 12,HASLAR MARINA,HASLAR ROAD,GOSPORT,,PO12 1NU,92060000,Musical instruments; parts and accessories for such,"Percussion musical instruments, e.g. drums, xylophones, cymbals, castanets, maracas",Import,3,2024
ABSOLUTE MUSIC,UNIT 3-5,KNIGHTON HEATH ESTATE,855 RINGWOOD ROAD,BOURNEMOUTH,,BH11 8NE,92060000,Musical instruments; parts and accessories for such,"Percussion musical instruments, e.g. drums, xylophones, cymbals, castanets, maracas",Import,1,2024
ABSOLUTE MUSIC,UNIT 3-5,KNIGHTON HEATH ESTATE,855 RINGWOOD ROAD,BOURNEMOUTH,,BH11 8NE,92060000,Musical instruments; parts and accessories for such,"Percussion musical instruments, e.g. drums, xylophones, cymbals, castanets, maracas",Import,2,2024
ACOUSTIC PERCUSSION LTD,9 PERCY STREET,LIVERPOOL,,,,L8 7LT,92060000,Musical instruments; parts and accessories for such,"Percussion musical instruments, e.g. drums, xylophones, cymbals, castanets, maracas",Export,2,2024
ACOUSTIC PERCUSSION LTD,9 PERCY STREET,LIVERPOOL,,,,L8 7LT,92060000,Musical instruments; parts and accessories for such,"Percussion musical instruments, e.g. drums, xylophones, cymbals, castanets, maracas",Export,4,2024
ACTIVE MUSIC DISTRIBUTION,UNIT 7,GOOSE GREEN TRADING ESTATE,47 EAST DULWICH ROAD,LONDON,,SE22 9BN,92060000,Musical instruments; parts and accessories for such,"Percussion musical instruments, e.g. drums, xylophones, cymbals, castanets, maracas",Import,1,2024
ACTIVE MUSIC DISTRIBUTION,UNIT 7,GOOSE GREEN TRADING ESTATE,47 EAST DULWICH ROAD,LONDON,,SE22 9BN,92060000,Musical instruments; parts and accessories for such,"Percussion musical instruments, e.g. drums, xylophones, cymbals, castanets, maracas",Import,3,2024
AMAZON EU SARL,1 PRINCIPAL PLACE,WORSHIP STREET,LONDON,,,EC2A 2FA,92060000,Musical instruments; parts and accessories for such,"Percussion musical instruments, e.g. drums, xylophones, cymbals, castanets, maracas",Import,1,2024
AMAZON EU SARL,1 PRINCIPAL PLACE,WORSHIP STREET,LONDON,,,EC2A 2FA,92060000,Musical instruments; parts and accessories for such,"Percussion musical instruments, e.g. drums, xylophones, cymbals, castanets, maracas",Import,2,2024
AMAZON EU SARL,1 PRINCIPAL PLACE,WORSHIP STREET,LONDON,,,EC2A 2FA,92060000,Musical instruments; parts and accessories for such,"Percussion musical instruments, e.g. drums, xylophones, cymbals, castanets, maracas",Import,3,2024
AMAZON EU SARL,1 PRINCIPAL PLACE,WORSHIP STREET,LONDON,,,EC2A 2FA,92060000,Musical instruments; parts and accessories for such,"Percussion musical instruments, e.g. drums, xylophones, cymbals, castanets, maracas",Import,4,2024
AMAZON GLOBAL STORE EU SARL,1 PRINCIPAL PLACE WORSHIP S,LONDON,GREATER LONDON,,,EC2A 2FA,92060000,Musical instruments; parts and accessories for such,"Percussion musical instruments, e.g. drums, xylophones, cymbals, castanets, maracas",Export,1,2024
AMAZON GLOBAL STORE EU SARL,1 PRINCIPAL PLACE WORSHIP S,LONDON,GREATER LONDON,,,EC2A 2FA,92060000,Musical instruments; parts and accessories for such,"Percussion musical instruments, e.g. drums, xylophones, cymbals, castanets, maracas",Export,3,2024
AMMO AND COMPANY LTD,UNIT 17,GRAVELLY INDUSTRIAL PARK,BIRMINGHAM,,,B24 8HZ,92060000,Musical instruments; parts and accessories for such,"Percussion musical instruments, e.g. drums, xylophones, cymbals, castanets, maracas",Export,3,2024
AMMO AND COMPANY LTD,UNIT 17,GRAVELLY INDUSTRIAL PARK,BIRMINGHAM,,,B24 8HZ,92060000,Musical instruments; parts and accessories for such,"Percussion musical instruments, e.g. drums, xylophones, cymbals, castanets, maracas",Import,4,2024
ANCIENT WISDOM MARKETING LTD,AFFINITY PARK,EUROPA DRIVE,SHEFFIELD,,,S9 1XT,92060000,Musical instruments; parts and accessories for such,"Percussion musical instruments, e.g. drums, xylophones, cymbals, castanets, maracas",Import,4,2024
ASCENT CRYSTAL LIMITED,"5, CANTWELL HOUSE 3-13",SHIPBUILDING WAY,LONDON,,,E13 9GL,92060000,Musical instruments; parts and accessories for such,"Percussion musical instruments, e.g. drums, xylophones, cymbals, castanets, maracas",Import,2,2024
ASCENT CRYSTAL LIMITED,"5, CANTWELL HOUSE 3-13",SHIPBUILDING WAY,LONDON,,,E13 9GL,92060000,Musical instruments; parts and accessories for such,"Percussion musical instruments, e.g. drums, xylophones, cymbals, castanets, maracas",Import,4,2024
AVSL GROUP LTD,UNIT 2,BRIDGEWATER PARK,TAYLOR ROAD,TRAFFORD PARK,,M41 7JQ,92060000,Musical instruments; parts and accessories for such,"Percussion musical instruments, e.g. drums, xylophones, cymbals, castanets, maracas",Import,2,2024
BABI PUR LTD,BABI PUR TOWERS,GELERT HOUSE,PENAMSER ROAD,PORTHMADOG,,LL49 9NY,92060000,Musical instruments; parts and accessories for such,"Percussion musical instruments, e.g. drums, xylophones, cymbals, castanets, maracas",Import,4,2024
BAND SUPPLIES LTD,13-15 OLD DUMBARTON ROAD,GLASGOW,,,,G3 8QY,92060000,Musical instruments; parts and accessories for such,"Percussion musical instruments, e.g. drums, xylophones, cymbals, castanets, maracas",Export,2,2024
BAND SUPPLIES LTD,13-15 OLD DUMBARTON ROAD,GLASGOW,,,,G3 8QY,92060000,Musical instruments; parts and accessories for such,"Percussion musical instruments, e.g. drums, xylophones, cymbals, castanets, maracas",Import,2,2024
BAX-SHOP.CO.UK LIMITED,"1 RHODIUM POINT,HAWKINGE BU",SPINDLE CLOSE,HAWKINGE,FOLKESTONE,,CT18 7TQ,92060000,Musical instruments; parts and accessories for such,"Percussion musical instruments, e.g. drums, xylophones, cymbals, castanets, maracas",Import,1,2024
BAX-SHOP.CO.UK LIMITED,"1 RHODIUM POINT,HAWKINGE BU",SPINDLE CLOSE,HAWKINGE,FOLKESTONE,,CT18 7TQ,92060000,Musical instruments; parts and accessories for such,"Percussion musical instruments, e.g. drums, xylophones, cymbals, castanets, maracas",Import,2,2024
BAX-SHOP.CO.UK LIMITED,"1 RHODIUM POINT,HAWKINGE BU",SPINDLE CLOSE,HAWKINGE,FOLKESTONE,,CT18 7TQ,92060000,Musical instruments; parts and accessories for such,"Percussion musical instruments, e.g. drums, xylophones, cymbals, castanets, maracas",Import,3,2024
BAX-SHOP.CO.UK LIMITED,"1 RHODIUM POINT,HAWKINGE BU",SPINDLE CLOSE,HAWKINGE,FOLKESTONE,,CT18 7TQ,92060000,Musical instruments; parts and accessories for such,"Percussion musical instruments, e.g. drums, xylophones, cymbals, castanets, maracas",Import,4,2024
BEAR LOVE,GLANDWR,PONTSIAN,LLANDYSUL,,,SA44 4UA,92060000,Musical instruments; parts and accessories for such,"Percussion musical instruments, e.g. drums, xylophones, cymbals, castanets, maracas",Export,1,2024
BEAR LOVE,GLANDWR,PONTSIAN,LLANDYSUL,,,SA44 4UA,92060000,Musical instruments; parts and accessories for such,"Percussion musical instruments, e.g. drums, xylophones, cymbals, castanets, maracas",Export,2,2024
BEAR LOVE,GLANDWR,PONTSIAN,LLANDYSUL,,,SA44 4UA,92060000,Musical instruments; parts and accessories for such,"Percussion musical instruments, e.g. drums, xylophones, cymbals, castanets, maracas",Export,3,2024
BELLS OF WHITECHAPEL LIMITED,"UNIT Q, THE ENTERPRISE CENT",27 HASTINGS ROAD,BROMLEY,GREATER LONDON,,BR2 8NA,92060000,Musical instruments; parts and accessories for such,"Percussion musical instruments, e.g. drums, xylophones, cymbals, castanets, maracas",Import,1,2024
BELLS OF WHITECHAPEL LIMITED,"UNIT Q, THE ENTERPRISE CENT",27 HASTINGS ROAD,BROMLEY,GREATER LONDON,,BR2 8NA,92060000,Musical instruments; parts and accessories for such,"Percussion musical instruments, e.g. drums, xylophones, cymbals, castanets, maracas",Export,2,2024
BELLS OF WHITECHAPEL LIMITED,"UNIT Q, THE ENTERPRISE CENT",27 HASTINGS ROAD,BROMLEY,GREATER LONDON,,BR2 8NA,92060000,Musical instruments; parts and accessories for such,"Percussion musical instruments, e.g. drums, xylophones, cymbals, castanets, maracas",Export,4,2024
BOOTS UK LTD,D90  WF18,SUPPLY CHAIN IMPORTS,THANE ROAD,NOTTINGHAM,,NG90 1BS,92060000,Musical instruments; parts and accessories for such,"Percussion musical instruments, e.g. drums, xylophones, cymbals, castanets, maracas",Import,1,2024
BOSCO BROTHERS LTD,UNIT 27,OLDENDS INDUSTRIAL ESTATE,OLDENDS,STONEHOUSE,,GL10 3RQ,92060000,Musical instruments; parts and accessories for such,"Percussion musical instruments, e.g. drums, xylophones, cymbals, castanets, maracas",Import,1,2024
BOSCO BROTHERS LTD,UNIT 27,OLDENDS INDUSTRIAL ESTATE,OLDENDS,STONEHOUSE,,GL10 3RQ,92060000,Musical instruments; parts and accessories for such,"Percussion musical instruments, e.g. drums, xylophones, cymbals, castanets, maracas",Import,3,2024
BOSCO BROTHERS LTD,UNIT 27,OLDENDS INDUSTRIAL ESTATE,OLDENDS,STONEHOUSE,,GL10 3RQ,92060000,Musical instruments; parts and accessories for such,"Percussion musical instruments, e.g. drums, xylophones, cymbals, castanets, maracas",Import,4,2024
BR DISTRIBUTION LTD,UNIT 3,TANFIELD LEA SOUTH IND ESTATE,TANFIELD LEA,STANLEY,COUNTY DURHAM,DH9 9XA,92060000,Musical instruments; parts and accessories for such,"Percussion musical instruments, e.g. drums, xylophones, cymbals, castanets, maracas",Import,2,2024
BR DISTRIBUTION LTD,UNIT 3,TANFIELD LEA SOUTH IND ESTATE,TANFIELD LEA,STANLEY,COUNTY DURHAM,DH9 9XA,92060000,Musical instruments; parts and accessories for such,"Percussion musical instruments, e.g. drums, xylophones, cymbals, castanets, maracas",Import,3,2024
BR DISTRIBUTION LTD,UNIT 3,TANFIELD LEA SOUTH IND ESTATE,TANFIELD LEA,STANLEY,COUNTY DURHAM,DH9 9XA,92060000,Musical instruments; parts and accessories for such,"Percussion musical instruments, e.g. drums, xylophones, cymbals, castanets, maracas",Import,4,2024
BROADWAY BRASS LIMITED,UNIT 2,BRUNSWICK INDUSTRIAL CENTRE,"HERTFORD ST, BALSALL HEATH",BIRMINGHAM,,B12 8NJ,92060000,Musical instruments; parts and accessories for such,"Percussion musical instruments, e.g. drums, xylophones, cymbals, castanets, maracas",Export,3,2024
BS RETAILCO LTD,BOMBAY BUILDINGS,SHEARBRIDGE ROAD,BRADFORD,,,BD7 1NX,92060000,Musical instruments; parts and accessories for such,"Percussion musical instruments, e.g. drums, xylophones, cymbals, castanets, maracas",Export,2,2024
BS RETAILCO LTD,BOMBAY BUILDINGS,SHEARBRIDGE ROAD,BRADFORD,,,BD7 1NX,92060000,Musical instruments; parts and accessories for such,"Percussion musical instruments, e.g. drums, xylophones, cymbals, castanets, maracas",Export,4,2024
CARLTON COOPER BANKS,VICTORIA FARM,VICTORIA,HOWDEN LE WEAR,CROOK,,DL15 8BE,92060000,Musical instruments; parts and accessories for such,"Percussion musical instruments, e.g. drums, xylophones, cymbals, castanets, maracas",Import,2,2024
CARLY GRACE GILBERT,FLAT 7,13 ETON AVENUE,LONDON,UK,,NW3 3EL,92060000,Musical instruments; parts and accessories for such,"Percussion musical instruments, e.g. drums, xylophones, cymbals, castanets, maracas",Import,1,2024
CARLY GRACE GILBERT,FLAT 7,13 ETON AVENUE,LONDON,UK,,NW3 3EL,92060000,Musical instruments; parts and accessories for such,"Percussion musical instruments, e.g. drums, xylophones, cymbals, castanets, maracas",Import,2,2024
CARLY GRACE GILBERT,FLAT 7,13 ETON AVENUE,LONDON,UK,,NW3 3EL,92060000,Musical instruments; parts and accessories for such,"Percussion musical instruments, e.g. drums, xylophones, cymbals, castanets, maracas",Import,4,2024
CHANGING WORLD IMPORTS LIMITED,"SUIT 2A, BLACKTHORN HOUSE",ST PAULS SQUARE,BIRMINGHAM,WEST MIDLANDS,,B3 1RL,92060000,Musical instruments; parts and accessories for such,"Percussion musical instruments, e.g. drums, xylophones, cymbals, castanets, maracas",Import,3,2024
CHANGSHA JIFENGHUWAI WENTI YONGPIN YOU XIAN GONGSI,UNIT 19 ELDON WAY,INDUSTRIAL ESTATE,BIGGLESWADE,,,SG18 8NH,92060000,Musical instruments; parts and accessories for such,"Percussion musical instruments, e.g. drums, xylophones, cymbals, castanets, maracas",Import,1,2024
CHANGSHA JIFENGHUWAI WENTI YONGPIN YOU XIAN GONGSI,UNIT 19 ELDON WAY,INDUSTRIAL ESTATE,BIGGLESWADE,,,SG18 8NH,92060000,Musical instruments; parts and accessories for such,"Percussion musical instruments, e.g. drums, xylophones, cymbals, castanets, maracas",Import,3,2024
CHANGSHA JIFENGHUWAI WENTI YONGPIN YOU XIAN GONGSI,UNIT 19 ELDON WAY,INDUSTRIAL ESTATE,BIGGLESWADE,,,SG18 8NH,92060000,Musical instruments; parts and accessories for such,"Percussion musical instruments, e.g. drums, xylophones, cymbals, castanets, maracas",Import,4,2024
"CHANGSHAOPEXTRADINGCO.,LTD.",HM REVENUE AND CUSTOMS,RUBY HOUSE,8 RUBY PLACE,ABERDEEN,,AB10 1ZP,92060000,Musical instruments; parts and accessories for such,"Percussion musical instruments, e.g. drums, xylophones, cymbals, castanets, maracas",Import,2,2024
"CHANGSHAOPEXTRADINGCO.,LTD.",HM REVENUE AND CUSTOMS,RUBY HOUSE,8 RUBY PLACE,ABERDEEN,,AB10 1ZP,92060000,Musical instruments; parts and accessories for such,"Percussion musical instruments, e.g. drums, xylophones, cymbals, castanets, maracas",Import,3,2024
CHAOZHOU WANCHAOLAIKEJI YOUXIANGONGSI,HM REVENUE AND CUSTOMS,RUBY HOUSE,8 RUBY PLACE,ABERDEEN,,AB10 1ZP,92060000,Musical instruments; parts and accessories for such,"Percussion musical instruments, e.g. drums, xylophones, cymbals, castanets, maracas",Import,1,2024
CHAPMAN JAMES,41 WESTGATE CLOSE CANTERBURY,,-,,,CT2 8JH,92060000,Musical instruments; parts and accessories for such,"Percussion musical instruments, e.g. drums, xylophones, cymbals, castanets, maracas",Import,2,2024
CHENGDU YUQIANGQINZI GONGYINGLIANGUANLIYOUXIANGONGSI,UNIT 19 ELDON WAY,INDUSTRIAL ESTATE,BIGGLESWADE,,,SG18 8NH,92060000,Musical instruments; parts and accessories for such,"Percussion musical instruments, e.g. drums, xylophones, cymbals, castanets, maracas",Import,1,2024
CHENGDU YUQIANGQINZI GONGYINGLIANGUANLIYOUXIANGONGSI,UNIT 19 ELDON WAY,INDUSTRIAL ESTATE,BIGGLESWADE,,,SG18 8NH,92060000,Musical instruments; parts and accessories for such,"Percussion musical instruments, e.g. drums, xylophones, cymbals, castanets, maracas",Import,4,2024
COHORT FILM SERVICES LTD,UNIT 5,FAIRVIEW INDUSTRIAL ESTATE,RAANS ROAD,AMERSHAM,,HP6 6JY,92060000,Musical instruments; parts and accessories for such,"Percussion musical instruments, e.g. drums, xylophones, cymbals, castanets, maracas",Export,3,2024
CONN-SELMER EUROPE LIMITED,551 FAIRLIE ROAD,SLOUGH,BERKSHIRE,,,SL1 4PY,92060000,Musical instruments; parts and accessories for such,"Percussion musical instruments, e.g. drums, xylophones, cymbals, castanets, maracas",Import,1,2024
CONN-SELMER EUROPE LIMITED,551 FAIRLIE ROAD,SLOUGH,BERKSHIRE,,,SL1 4PY,92060000,Musical instruments; parts and accessories for such,"Percussion musical instruments, e.g. drums, xylophones, cymbals, castanets, maracas",Import,2,2024
CONN-SELMER EUROPE LIMITED,551 FAIRLIE ROAD,SLOUGH,BERKSHIRE,,,SL1 4PY,92060000,Musical instruments; parts and accessories for such,"Percussion musical instruments, e.g. drums, xylophones, cymbals, castanets, maracas",Export,3,2024
CONN-SELMER EUROPE LIMITED,551 FAIRLIE ROAD,SLOUGH,BERKSHIRE,,,SL1 4PY,92060000,Musical instruments; parts and accessories for such,"Percussion musical instruments, e.g. drums, xylophones, cymbals, castanets, maracas",Export,4,2024
CONN-SELMER EUROPE LIMITED,551 FAIRLIE ROAD,SLOUGH,BERKSHIRE,,,SL1 4PY,92060000,Musical instruments; parts and accessories for such,"Percussion musical instruments, e.g. drums, xylophones, cymbals, castanets, maracas",Import,4,2024
CRAZE TRADE LIMITED,UNIT 5,MARTINBRIDGE INDUSTRIAL EST,240-242 LINCOLN ROAD,ENFIELD,,EN1 1SP,92060000,Musical instruments; parts and accessories for such,"Percussion musical instruments, e.g. drums, xylophones, cymbals, castanets, maracas",Import,4,2024
CRYSTAL SINGING BOWLS LIMIT ED,6 THE ORCHARDS,RINGMER,LEWES,,,BN8 5FR,92060000,Musical instruments; parts and accessories for such,"Percussion musical instruments, e.g. drums, xylophones, cymbals, castanets, maracas",Import,1,2024
CRYSTAL SINGING BOWLS LIMIT ED,6 THE ORCHARDS,RINGMER,LEWES,,,BN8 5FR,92060000,Musical instruments; parts and accessories for such,"Percussion musical instruments, e.g. drums, xylophones, cymbals, castanets, maracas",Import,2,2024
CRYSTAL SINGING BOWLS LIMIT ED,6 THE ORCHARDS,RINGMER,LEWES,,,BN8 5FR,92060000,Musical instruments; parts and accessories for such,"Percussion musical instruments, e.g. drums, xylophones, cymbals, castanets, maracas",Export,3,2024
CSG GLOBAL EDUCATION LTD,UNIT 11,SHEPLEY INDUSTRIAL ESTATE (,AUDENSHAW,MANCHESTER,,M34 5EX,92060000,Musical instruments; parts and accessories for such,"Percussion musical instruments, e.g. drums, xylophones, cymbals, castanets, maracas",Export,4,2024
D J O SERVICES LTD,14 RUSSLEY GREEN,WOKINGHAM,BERKS,,,RG40 3HT,92060000,Musical instruments; parts and accessories for such,"Percussion musical instruments, e.g. drums, xylophones, cymbals, castanets, maracas",Export,3,2024
D'ADDARIO UK LIMITED,UNIT 2 GREENFINCH WAY,NEWBURN RIVERSIDE,NEWCASTLE,,,NE15 8NX,92060000,Musical instruments; parts and accessories for such,"Percussion musical instruments, e.g. drums, xylophones, cymbals, castanets, maracas",Export,1,2024
DANIEL MCRAE,131-133,HIGH STREET,INVERGORDON,,,IV18 0AJ,92060000,Musical instruments; parts and accessories for such,"Percussion musical instruments, e.g. drums, xylophones, cymbals, castanets, maracas",Import,4,2024
DATIANXIAN XINGYU TONGXUNDIAN,"SUITE112,VISION25",ELECTRIC AVENUE,ENFIELD,,,EN3 7GD,92060000,Musical instruments; parts and accessories for such,"Percussion musical instruments, e.g. drums, xylophones, cymbals, castanets, maracas",Import,3,2024
DATIANXIAN XINGYU TONGXUNDIAN,"SUITE112,VISION25",ELECTRIC AVENUE,ENFIELD,,,EN3 7GD,92060000,Musical instruments; parts and accessories for such,"Percussion musical instruments, e.g. drums, xylophones, cymbals, castanets, maracas",Import,4,2024
DAVID BURDESS ORTHODONTICS LTD,RYEFIELD WAY,SILSDEN,WEST YORKSHIRE,,,BD20 0EF,92060000,Musical instruments; parts and accessories for such,"Percussion musical instruments, e.g. drums, xylophones, cymbals, castanets, maracas",Import,3,2024
DAVID CHETWYND,4 WETLEY AVENUE,WERRINGTON,STOKE-ON-TRENT,STAFFORDSHIRE,"STOKE-ON-TRENT, GREAT BRITAIN",ST9 0HY,92060000,Musical instruments; parts and accessories for such,"Percussion musical instruments, e.g. drums, xylophones, cymbals, castanets, maracas",Export,2,2024
DAVID CHETWYND,4 WETLEY AVENUE,WERRINGTON,STOKE-ON-TRENT,STAFFORDSHIRE,"STOKE-ON-TRENT, GREAT BRITAIN",ST9 0HY,92060000,Musical instruments; parts and accessories for such,"Percussion musical instruments, e.g. drums, xylophones, cymbals, castanets, maracas",Export,3,2024
DONGGUAN SHI YIXIYUNHENG SHANGMAO YOUXIAN GONGSI,HM REVENUE AND CUSTOMS,RUBY HOUSE,8 RUBY PLACE,ABERDEEN,,AB10 1ZP,92060000,Musical instruments; parts and accessories for such,"Percussion musical instruments, e.g. drums, xylophones, cymbals, castanets, maracas",Import,2,2024
DRUM CENTRAL EDINBURGH LTD,125 GREAT JUNCTION STREET,EDINBURGH,,,,EH6 5JB,92060000,Musical instruments; parts and accessories for such,"Percussion musical instruments, e.g. drums, xylophones, cymbals, castanets, maracas",Import,3,2024
DRUMAZON LTD,9 WATERSIDE BUSINESS PARK L,CARDIFF,,,,CF3 2ET,92060000,Musical instruments; parts and accessories for such,"Percussion musical instruments, e.g. drums, xylophones, cymbals, castanets, maracas",Export,1,2024
DRUMAZON LTD,9 WATERSIDE BUSINESS PARK L,CARDIFF,,,,CF3 2ET,92060000,Musical instruments; parts and accessories for such,"Percussion musical instruments, e.g. drums, xylophones, cymbals, castanets, maracas",Import,1,2024
DRUMAZON LTD,9 WATERSIDE BUSINESS PARK L,CARDIFF,,,,CF3 2ET,92060000,Musical instruments; parts and accessories for such,"Percussion musical instruments, e.g. drums, xylophones, cymbals, castanets, maracas",Import,2,2024
DRUMAZON LTD,9 WATERSIDE BUSINESS PARK L,CARDIFF,,,,CF3 2ET,92060000,Musical instruments; parts and accessories for such,"Percussion musical instruments, e.g. drums, xylophones, cymbals, castanets, maracas",Export,3,2024
DRUMAZON LTD,9 WATERSIDE BUSINESS PARK L,CARDIFF,,,,CF3 2ET,92060000,Musical instruments; parts and accessories for such,"Percussion musical instruments, e.g. drums, xylophones, cymbals, castanets, maracas",Export,4,2024
DRUMAZON LTD,9 WATERSIDE BUSINESS PARK L,CARDIFF,,,,CF3 2ET,92060000,Musical instruments; parts and accessories for such,"Percussion musical instruments, e.g. drums, xylophones, cymbals, castanets, maracas",Import,4,2024
DRUMLINE LTD,12 ATHENA CLOSE,FAIR OAK,EASTLEIGH,HAMPSHIRE,,SO50 8QP,92060000,Musical instruments; parts and accessories for such,"Percussion musical instruments, e.g. drums, xylophones, cymbals, castanets, maracas",Export,4,2024
DRUMS FOR SCHOOLS LTD,21 SHAFTESBURY AVENUE,BURTON JOYCE,NOTTINGHAM,,,NG14 5GL,92060000,Musical instruments; parts and accessories for such,"Percussion musical instruments, e.g. drums, xylophones, cymbals, castanets, maracas",Export,2,2024
DRUMS FOR SCHOOLS LTD,21 SHAFTESBURY AVENUE,BURTON JOYCE,NOTTINGHAM,,,NG14 5GL,92060000,Musical instruments; parts and accessories for such,"Percussion musical instruments, e.g. drums, xylophones, cymbals, castanets, maracas",Export,3,2024
DRUMSHACK LTD,58 LAVENDER HILL,BATTERSEA,LONDON,,,SW11 5RQ,92060000,Musical instruments; parts and accessories for such,"Percussion musical instruments, e.g. drums, xylophones, cymbals, castanets, maracas",Import,1,2024
DRUMSHACK LTD,58 LAVENDER HILL,BATTERSEA,LONDON,,,SW11 5RQ,92060000,Musical instruments; parts and accessories for such,"Percussion musical instruments, e.g. drums, xylophones, cymbals, castanets, maracas",Import,2,2024
DRUMSHACK LTD,58 LAVENDER HILL,BATTERSEA,LONDON,,,SW11 5RQ,92060000,Musical instruments; parts and accessories for such,"Percussion musical instruments, e.g. drums, xylophones, cymbals, castanets, maracas",Import,3,2024
DRUMSHACK LTD,58 LAVENDER HILL,BATTERSEA,LONDON,,,SW11 5RQ,92060000,Musical instruments; parts and accessories for such,"Percussion musical instruments, e.g. drums, xylophones, cymbals, castanets, maracas",Import,4,2024
E KAPITAL LIMITED,29 WHINHAM GREEN,AYLESBURY,,,,HP18 0XJ,92060000,Musical instruments; parts and accessories for such,"Percussion musical instruments, e.g. drums, xylophones, cymbals, castanets, maracas",Export,3,2024
ELIZABETH COOPER,THE OLD HOUSE,8 CHURCH ROAD,ALDINGBOURNE,CHICHESTER,,PO20 3TT,92060000,Musical instruments; parts and accessories for such,"Percussion musical instruments, e.g. drums, xylophones, cymbals, castanets, maracas",Import,2,2024
ELIZABETH COOPER,THE OLD HOUSE,8 CHURCH ROAD,ALDINGBOURNE,CHICHESTER,,PO20 3TT,92060000,Musical instruments; parts and accessories for such,"Percussion musical instruments, e.g. drums, xylophones, cymbals, castanets, maracas",Export,4,2024
ENGLISH NATIONAL OPERA,LONDON COLISEUM,ST MARTINS LANE,LONDON,,,WC2N 4ES,92060000,Musical instruments; parts and accessories for such,"Percussion musical instruments, e.g. drums, xylophones, cymbals, castanets, maracas",Import,2,2024
EQUIP MY SCHOOL LIMITED,ACHURCH CLOSE,HORNCASTLE,LINCOLNSHIRE,,,LN9 6JS,92060000,Musical instruments; parts and accessories for such,"Percussion musical instruments, e.g. drums, xylophones, cymbals, castanets, maracas",Export,4,2024
EUACQUICO 1 LIMITED,27 OLD GLOUCESTER STREET,LONDON,,,,WC1N 3AX,92060000,Musical instruments; parts and accessories for such,"Percussion musical instruments, e.g. drums, xylophones, cymbals, castanets, maracas",Import,1,2024
EUACQUICO 1 LIMITED,27 OLD GLOUCESTER STREET,LONDON,,,,WC1N 3AX,92060000,Musical instruments; parts and accessories for such,"Percussion musical instruments, e.g. drums, xylophones, cymbals, castanets, maracas",Import,2,2024
EUACQUICO 1 LIMITED,27 OLD GLOUCESTER STREET,LONDON,,,,WC1N 3AX,92060000,Musical instruments; parts and accessories for such,"Percussion musical instruments, e.g. drums, xylophones, cymbals, castanets, maracas",Import,4,2024
EV-ENTZ.CO.UK LTD,KARAMA,2A FFOREST GLADE,NEWPORT,,,NP19 8NE,92060000,Musical instruments; parts and accessories for such,"Percussion musical instruments, e.g. drums, xylophones, cymbals, castanets, maracas",Import,3,2024