CompanyName,Address1,Address2,Address3,Address4,Address5,PostCode,CommodityCode,HS2Description,CN8Description,TradeTypeDescription,Month,Year
2XL UK LIMITED,SUITES 3 AND 4 PRIORY HOUSE,SAXON WAY,HESSLE,,,HU13 9PB,21039090,Miscellaneous edible preparations,"Sauces and preparations therefor, mixed condiments and mixed seasonings (excl. soya sauce, tomato ketchup and other tomato sauces, liquid mango chutney and aromatic bitters of subheading 2103.90.30)",Export,3,2024
3 IN 1 BURGER LTD,314 LADYPOOL ROAD,BIRMINGHAM,,,,B12 8JY,21039090,Miscellaneous edible preparations,"Sauces and preparations therefor, mixed condiments and mixed seasonings (excl. soya sauce, tomato ketchup and other tomato sauces, liquid mango chutney and aromatic bitters of subheading 2103.90.30)",Import,2,2024
35 FOODS LTD,HM REVENUE AND CUSTOMS,RUBY HOUSE,8 RUBY PLACE,ABERDEEN,,AB10 1ZP,21039090,Miscellaneous edible preparations,"Sauces and preparations therefor, mixed condiments and mixed seasonings (excl. soya sauce, tomato ketchup and other tomato sauces, liquid mango chutney and aromatic bitters of subheading 2103.90.30)",Import,2,2024
360 AGILITY COMPLEXITY EVOLVABILITYSOLUTIONUK LTD,UNIT HD02,50 CAMBRIDGE ROAD,BARKING,,,IG11 8FG,21039090,Miscellaneous edible preparations,"Sauces and preparations therefor, mixed condiments and mixed seasonings (excl. soya sauce, tomato ketchup and other tomato sauces, liquid mango chutney and aromatic bitters of subheading 2103.90.30)",Import,2,2024
360 AGILITY COMPLEXITY EVOLVABILITYSOLUTIONUK LTD,UNIT HD02,50 CAMBRIDGE ROAD,BARKING,,,IG11 8FG,21039090,Miscellaneous edible preparations,"Sauces and preparations therefor, mixed condiments and mixed seasonings (excl. soya sauce, tomato ketchup and other tomato sauces, liquid mango chutney and aromatic bitters of subheading 2103.90.30)",Import,3,2024
360 AGILITY COMPLEXITY EVOLVABILITYSOLUTIONUK LTD,UNIT HD02,50 CAMBRIDGE ROAD,BARKING,,,IG11 8FG,21039090,Miscellaneous edible preparations,"Sauces and preparations therefor, mixed condiments and mixed seasonings (excl. soya sauce, tomato ketchup and other tomato sauces, liquid mango chutney and aromatic bitters of subheading 2103.90.30)",Import,4,2024
3S XPO & MPO LTD,UNIT 1 RADYR COURT SHOPPING D,"NESCOURT WAY, LLANDAFF",CARDIFF,,,CF5 2SF,21039090,Miscellaneous edible preparations,"Sauces and preparations therefor, mixed condiments and mixed seasonings (excl. soya sauce, tomato ketchup and other tomato sauces, liquid mango chutney and aromatic bitters of subheading 2103.90.30)",Import,1,2024
A C PREMIER FOODS UK LTD,11 SOUTH AVENUE SOUTHALL,,MIDDLESEX,,,UB1 2AH,21039090,Miscellaneous edible preparations,"Sauces and preparations therefor, mixed condiments and mixed seasonings (excl. soya sauce, tomato ketchup and other tomato sauces, liquid mango chutney and aromatic bitters of subheading 2103.90.30)",Import,1,2024
A DI MARIA & SONS LTD,4 THE STAMPINGS BLUE RIBBON,COVENTRY,WEST MIDLANDS,,,CV6 5RE,21039090,Miscellaneous edible preparations,"Sauces and preparations therefor, mixed condiments and mixed seasonings (excl. soya sauce, tomato ketchup and other tomato sauces, liquid mango chutney and aromatic bitters of subheading 2103.90.30)",Import,4,2024
A G PARFETT AND SONS LTD,DIDSBURY ROAD,HEATON MERSEY,STOCKPORT,CHESHIRE,,SK4 2JP,21039090,Miscellaneous edible preparations,"Sauces and preparations therefor, mixed condiments and mixed seasonings (excl. soya sauce, tomato ketchup and other tomato sauces, liquid mango chutney and aromatic bitters of subheading 2103.90.30)",Export,1,2024
A H EMPIRE LTD,UNIT 592B,ATLAS ROAD,WEMBLEY,LONDON,,HA9 0TX,21039090,Miscellaneous edible preparations,"Sauces and preparations therefor, mixed condiments and mixed seasonings (excl. soya sauce, tomato ketchup and other tomato sauces, liquid mango chutney and aromatic bitters of subheading 2103.90.30)",Import,2,2024
A H EMPIRE LTD,UNIT 592B,ATLAS ROAD,WEMBLEY,LONDON,,HA9 0TX,21039090,Miscellaneous edible preparations,"Sauces and preparations therefor, mixed condiments and mixed seasonings (excl. soya sauce, tomato ketchup and other tomato sauces, liquid mango chutney and aromatic bitters of subheading 2103.90.30)",Import,3,2024
A H EMPIRE LTD,UNIT 592B,ATLAS ROAD,WEMBLEY,LONDON,,HA9 0TX,21039090,Miscellaneous edible preparations,"Sauces and preparations therefor, mixed condiments and mixed seasonings (excl. soya sauce, tomato ketchup and other tomato sauces, liquid mango chutney and aromatic bitters of subheading 2103.90.30)",Import,4,2024
A TO Z CATERING SUPPLIES LTD,BROTHER HOUSE,15A CRANFORD WAY,HORNSEY,LONDON,,N8 9DG,21039090,Miscellaneous edible preparations,"Sauces and preparations therefor, mixed condiments and mixed seasonings (excl. soya sauce, tomato ketchup and other tomato sauces, liquid mango chutney and aromatic bitters of subheading 2103.90.30)",Import,3,2024
A.R.T. FOODS LIMITED,RANSLETT HOUSE,EATON CONSTANTINE,SHREWSBURY,SHROPSHIRE,,SY5 6RE,21039090,Miscellaneous edible preparations,"Sauces and preparations therefor, mixed condiments and mixed seasonings (excl. soya sauce, tomato ketchup and other tomato sauces, liquid mango chutney and aromatic bitters of subheading 2103.90.30)",Import,1,2024
A.ROMANI LIMITED,UNIT 24A 284,WATER ROAD,WEMBLEY,LONDON,,HA0 1HX,21039090,Miscellaneous edible preparations,"Sauces and preparations therefor, mixed condiments and mixed seasonings (excl. soya sauce, tomato ketchup and other tomato sauces, liquid mango chutney and aromatic bitters of subheading 2103.90.30)",Import,2,2024
A.VOGEL LIMITED,2 BREWSTER PLACE,IRVINE,AYRSHIRE,,,KA11 5DD,21039090,Miscellaneous edible preparations,"Sauces and preparations therefor, mixed condiments and mixed seasonings (excl. soya sauce, tomato ketchup and other tomato sauces, liquid mango chutney and aromatic bitters of subheading 2103.90.30)",Export,2,2024
A.VOGEL LIMITED,2 BREWSTER PLACE,IRVINE,AYRSHIRE,,,KA11 5DD,21039090,Miscellaneous edible preparations,"Sauces and preparations therefor, mixed condiments and mixed seasonings (excl. soya sauce, tomato ketchup and other tomato sauces, liquid mango chutney and aromatic bitters of subheading 2103.90.30)",Import,4,2024
A1 EQUIPMENT LTD,6 THE CUBIC ESTATE,EASTMAN WAY,HEMEL HEMPSTEAD INDUSTRIAL,HEMEL HEMPSTEAD,,HP2 7DU,21039090,Miscellaneous edible preparations,"Sauces and preparations therefor, mixed condiments and mixed seasonings (excl. soya sauce, tomato ketchup and other tomato sauces, liquid mango chutney and aromatic bitters of subheading 2103.90.30)",Import,2,2024
A1 EQUIPMENT LTD,6 THE CUBIC ESTATE,EASTMAN WAY,HEMEL HEMPSTEAD INDUSTRIAL,HEMEL HEMPSTEAD,,HP2 7DU,21039090,Miscellaneous edible preparations,"Sauces and preparations therefor, mixed condiments and mixed seasonings (excl. soya sauce, tomato ketchup and other tomato sauces, liquid mango chutney and aromatic bitters of subheading 2103.90.30)",Export,3,2024
A1 EQUIPMENT LTD,6 THE CUBIC ESTATE,EASTMAN WAY,HEMEL HEMPSTEAD INDUSTRIAL,HEMEL HEMPSTEAD,,HP2 7DU,21039090,Miscellaneous edible preparations,"Sauces and preparations therefor, mixed condiments and mixed seasonings (excl. soya sauce, tomato ketchup and other tomato sauces, liquid mango chutney and aromatic bitters of subheading 2103.90.30)",Import,4,2024
A2Z FRUIT & VEG LTD,UNIT C,126 ALBERT ROAD,BRISTOL,,,BS2 0YA,21039090,Miscellaneous edible preparations,"Sauces and preparations therefor, mixed condiments and mixed seasonings (excl. soya sauce, tomato ketchup and other tomato sauces, liquid mango chutney and aromatic bitters of subheading 2103.90.30)",Import,2,2024
AAK INTERNATIONAL,KING GEORGE DOCK,HEDON ROAD,KINGSTON UPON HULL,EAST YORKSHIRE,,HU9 5PX,21039090,Miscellaneous edible preparations,"Sauces and preparations therefor, mixed condiments and mixed seasonings (excl. soya sauce, tomato ketchup and other tomato sauces, liquid mango chutney and aromatic bitters of subheading 2103.90.30)",Export,1,2024
AAK INTERNATIONAL,KING GEORGE DOCK,HEDON ROAD,KINGSTON UPON HULL,EAST YORKSHIRE,,HU9 5PX,21039090,Miscellaneous edible preparations,"Sauces and preparations therefor, mixed condiments and mixed seasonings (excl. soya sauce, tomato ketchup and other tomato sauces, liquid mango chutney and aromatic bitters of subheading 2103.90.30)",Import,1,2024
AAK INTERNATIONAL,KING GEORGE DOCK,HEDON ROAD,KINGSTON UPON HULL,EAST YORKSHIRE,,HU9 5PX,21039090,Miscellaneous edible preparations,"Sauces and preparations therefor, mixed condiments and mixed seasonings (excl. soya sauce, tomato ketchup and other tomato sauces, liquid mango chutney and aromatic bitters of subheading 2103.90.30)",Export,2,2024
AAK INTERNATIONAL,KING GEORGE DOCK,HEDON ROAD,KINGSTON UPON HULL,EAST YORKSHIRE,,HU9 5PX,21039090,Miscellaneous edible preparations,"Sauces and preparations therefor, mixed condiments and mixed seasonings (excl. soya sauce, tomato ketchup and other tomato sauces, liquid mango chutney and aromatic bitters of subheading 2103.90.30)",Export,3,2024
AAK INTERNATIONAL,KING GEORGE DOCK,HEDON ROAD,KINGSTON UPON HULL,EAST YORKSHIRE,,HU9 5PX,21039090,Miscellaneous edible preparations,"Sauces and preparations therefor, mixed condiments and mixed seasonings (excl. soya sauce, tomato ketchup and other tomato sauces, liquid mango chutney and aromatic bitters of subheading 2103.90.30)",Export,4,2024
AB WORLD FOODS LIMITED,KIRIBATI WAY,LEIGH,GREATER MANCHESTER,,,WN7 5RS,21039090,Miscellaneous edible preparations,"Sauces and preparations therefor, mixed condiments and mixed seasonings (excl. soya sauce, tomato ketchup and other tomato sauces, liquid mango chutney and aromatic bitters of subheading 2103.90.30)",Export,1,2024
AB WORLD FOODS LIMITED,KIRIBATI WAY,LEIGH,GREATER MANCHESTER,,,WN7 5RS,21039090,Miscellaneous edible preparations,"Sauces and preparations therefor, mixed condiments and mixed seasonings (excl. soya sauce, tomato ketchup and other tomato sauces, liquid mango chutney and aromatic bitters of subheading 2103.90.30)",Import,1,2024
AB WORLD FOODS LIMITED,KIRIBATI WAY,LEIGH,GREATER MANCHESTER,,,WN7 5RS,21039090,Miscellaneous edible preparations,"Sauces and preparations therefor, mixed condiments and mixed seasonings (excl. soya sauce, tomato ketchup and other tomato sauces, liquid mango chutney and aromatic bitters of subheading 2103.90.30)",Export,2,2024
AB WORLD FOODS LIMITED,KIRIBATI WAY,LEIGH,GREATER MANCHESTER,,,WN7 5RS,21039090,Miscellaneous edible preparations,"Sauces and preparations therefor, mixed condiments and mixed seasonings (excl. soya sauce, tomato ketchup and other tomato sauces, liquid mango chutney and aromatic bitters of subheading 2103.90.30)",Import,2,2024
AB WORLD FOODS LIMITED,KIRIBATI WAY,LEIGH,GREATER MANCHESTER,,,WN7 5RS,21039090,Miscellaneous edible preparations,"Sauces and preparations therefor, mixed condiments and mixed seasonings (excl. soya sauce, tomato ketchup and other tomato sauces, liquid mango chutney and aromatic bitters of subheading 2103.90.30)",Export,3,2024
AB WORLD FOODS LIMITED,KIRIBATI WAY,LEIGH,GREATER MANCHESTER,,,WN7 5RS,21039090,Miscellaneous edible preparations,"Sauces and preparations therefor, mixed condiments and mixed seasonings (excl. soya sauce, tomato ketchup and other tomato sauces, liquid mango chutney and aromatic bitters of subheading 2103.90.30)",Import,3,2024
AB WORLD FOODS LIMITED,KIRIBATI WAY,LEIGH,GREATER MANCHESTER,,,WN7 5RS,21039090,Miscellaneous edible preparations,"Sauces and preparations therefor, mixed condiments and mixed seasonings (excl. soya sauce, tomato ketchup and other tomato sauces, liquid mango chutney and aromatic bitters of subheading 2103.90.30)",Export,4,2024
AB WORLD FOODS LIMITED,KIRIBATI WAY,LEIGH,GREATER MANCHESTER,,,WN7 5RS,21039090,Miscellaneous edible preparations,"Sauces and preparations therefor, mixed condiments and mixed seasonings (excl. soya sauce, tomato ketchup and other tomato sauces, liquid mango chutney and aromatic bitters of subheading 2103.90.30)",Import,4,2024
AB&B GROUP LIMITED,85 GREAT PORTLAND STREET GREA,PORTLAND STREET,LONDON,,,W1W 7LT,21039090,Miscellaneous edible preparations,"Sauces and preparations therefor, mixed condiments and mixed seasonings (excl. soya sauce, tomato ketchup and other tomato sauces, liquid mango chutney and aromatic bitters of subheading 2103.90.30)",Import,3,2024
ABERDEEN SPLL PRODUCTS LIMITED,1 KENNINGTON LANE,LONDON,GREATER LONDON,,,SE11 4RG,21039090,Miscellaneous edible preparations,"Sauces and preparations therefor, mixed condiments and mixed seasonings (excl. soya sauce, tomato ketchup and other tomato sauces, liquid mango chutney and aromatic bitters of subheading 2103.90.30)",Import,4,2024
ABF GRAIN PRODUCTS LIMITED,ALLIED BAKERIES,SHARED SERVICE CENTRE,DUNNINGS BRIDGE ROAD,NETHERTON,LIVERPOOL,L30 6TG,21039090,Miscellaneous edible preparations,"Sauces and preparations therefor, mixed condiments and mixed seasonings (excl. soya sauce, tomato ketchup and other tomato sauces, liquid mango chutney and aromatic bitters of subheading 2103.90.30)",Export,1,2024
ABF GRAIN PRODUCTS LIMITED,ALLIED BAKERIES,SHARED SERVICE CENTRE,DUNNINGS BRIDGE ROAD,NETHERTON,LIVERPOOL,L30 6TG,21039090,Miscellaneous edible preparations,"Sauces and preparations therefor, mixed condiments and mixed seasonings (excl. soya sauce, tomato ketchup and other tomato sauces, liquid mango chutney and aromatic bitters of subheading 2103.90.30)",Import,1,2024
ABF GRAIN PRODUCTS LIMITED,ALLIED BAKERIES,SHARED SERVICE CENTRE,DUNNINGS BRIDGE ROAD,NETHERTON,LIVERPOOL,L30 6TG,21039090,Miscellaneous edible preparations,"Sauces and preparations therefor, mixed condiments and mixed seasonings (excl. soya sauce, tomato ketchup and other tomato sauces, liquid mango chutney and aromatic bitters of subheading 2103.90.30)",Export,2,2024
ABF GRAIN PRODUCTS LIMITED,ALLIED BAKERIES,SHARED SERVICE CENTRE,DUNNINGS BRIDGE ROAD,NETHERTON,LIVERPOOL,L30 6TG,21039090,Miscellaneous edible preparations,"Sauces and preparations therefor, mixed condiments and mixed seasonings (excl. soya sauce, tomato ketchup and other tomato sauces, liquid mango chutney and aromatic bitters of subheading 2103.90.30)",Import,2,2024
ABF GRAIN PRODUCTS LIMITED,ALLIED BAKERIES,SHARED SERVICE CENTRE,DUNNINGS BRIDGE ROAD,NETHERTON,LIVERPOOL,L30 6TG,21039090,Miscellaneous edible preparations,"Sauces and preparations therefor, mixed condiments and mixed seasonings (excl. soya sauce, tomato ketchup and other tomato sauces, liquid mango chutney and aromatic bitters of subheading 2103.90.30)",Export,3,2024
ABF GRAIN PRODUCTS LIMITED,ALLIED BAKERIES,SHARED SERVICE CENTRE,DUNNINGS BRIDGE ROAD,NETHERTON,LIVERPOOL,L30 6TG,21039090,Miscellaneous edible preparations,"Sauces and preparations therefor, mixed condiments and mixed seasonings (excl. soya sauce, tomato ketchup and other tomato sauces, liquid mango chutney and aromatic bitters of subheading 2103.90.30)",Import,3,2024
ABF GRAIN PRODUCTS LIMITED,ALLIED BAKERIES,SHARED SERVICE CENTRE,DUNNINGS BRIDGE ROAD,NETHERTON,LIVERPOOL,L30 6TG,21039090,Miscellaneous edible preparations,"Sauces and preparations therefor, mixed condiments and mixed seasonings (excl. soya sauce, tomato ketchup and other tomato sauces, liquid mango chutney and aromatic bitters of subheading 2103.90.30)",Export,4,2024
ABF GRAIN PRODUCTS LIMITED,ALLIED BAKERIES,SHARED SERVICE CENTRE,DUNNINGS BRIDGE ROAD,NETHERTON,LIVERPOOL,L30 6TG,21039090,Miscellaneous edible preparations,"Sauces and preparations therefor, mixed condiments and mixed seasonings (excl. soya sauce, tomato ketchup and other tomato sauces, liquid mango chutney and aromatic bitters of subheading 2103.90.30)",Import,4,2024
ABI & OLA GLOBAL LOGISTICS LIMITED,18C,HARKNESS STREET,MANCHESTER,,,M12 6BT,21039090,Miscellaneous edible preparations,"Sauces and preparations therefor, mixed condiments and mixed seasonings (excl. soya sauce, tomato ketchup and other tomato sauces, liquid mango chutney and aromatic bitters of subheading 2103.90.30)",Import,3,2024
ABIKER LTD,27 CARLTON BUSINESS PARK,CARLTON ROAD,ASHFORD,,,TN23 1EF,21039090,Miscellaneous edible preparations,"Sauces and preparations therefor, mixed condiments and mixed seasonings (excl. soya sauce, tomato ketchup and other tomato sauces, liquid mango chutney and aromatic bitters of subheading 2103.90.30)",Import,2,2024
ABRUZZO TRUFFLES LIMITED,7 HARLEQUIN PLACE,SHENLEY BROOK END,MILTON KEYNES,,,MK5 7FF,21039090,Miscellaneous edible preparations,"Sauces and preparations therefor, mixed condiments and mixed seasonings (excl. soya sauce, tomato ketchup and other tomato sauces, liquid mango chutney and aromatic bitters of subheading 2103.90.30)",Import,2,2024
ABUKAR HAJI ABOW IMANKEY,42 STATION ROAD,MANOR PARK,LONDON,,,E12 5BT,21039090,Miscellaneous edible preparations,"Sauces and preparations therefor, mixed condiments and mixed seasonings (excl. soya sauce, tomato ketchup and other tomato sauces, liquid mango chutney and aromatic bitters of subheading 2103.90.30)",Import,2,2024
ACCESS USA SHIPPING LLC,HM REVENUE AND CUSTOMS,RUBY HOUSE,8 RUBY PLACE,ABERDEEN,,AB10 1ZP,21039090,Miscellaneous edible preparations,"Sauces and preparations therefor, mixed condiments and mixed seasonings (excl. soya sauce, tomato ketchup and other tomato sauces, liquid mango chutney and aromatic bitters of subheading 2103.90.30)",Export,1,2024
ACE EXPORT SERVICES LTD,"OFFICE 10-12, BROOK HOUSE",BROOK STREET BUSINESS CTR,TIPTON,WEST MIDLANDS,,DY4 9DD,21039090,Miscellaneous edible preparations,"Sauces and preparations therefor, mixed condiments and mixed seasonings (excl. soya sauce, tomato ketchup and other tomato sauces, liquid mango chutney and aromatic bitters of subheading 2103.90.30)",Export,1,2024
ACE EXPORT SERVICES LTD,"OFFICE 10-12, BROOK HOUSE",BROOK STREET BUSINESS CTR,TIPTON,WEST MIDLANDS,,DY4 9DD,21039090,Miscellaneous edible preparations,"Sauces and preparations therefor, mixed condiments and mixed seasonings (excl. soya sauce, tomato ketchup and other tomato sauces, liquid mango chutney and aromatic bitters of subheading 2103.90.30)",Export,3,2024
ACE EXPORT SERVICES LTD,"OFFICE 10-12, BROOK HOUSE",BROOK STREET BUSINESS CTR,TIPTON,WEST MIDLANDS,,DY4 9DD,21039090,Miscellaneous edible preparations,"Sauces and preparations therefor, mixed condiments and mixed seasonings (excl. soya sauce, tomato ketchup and other tomato sauces, liquid mango chutney and aromatic bitters of subheading 2103.90.30)",Export,4,2024
ACM MEAT FACTORY LTD,UNIT 5,75 RIVER ROAD,BARKING,GREATER LONDON,,IG11 0DR,21039090,Miscellaneous edible preparations,"Sauces and preparations therefor, mixed condiments and mixed seasonings (excl. soya sauce, tomato ketchup and other tomato sauces, liquid mango chutney and aromatic bitters of subheading 2103.90.30)",Import,3,2024
ACM MEAT FACTORY LTD,UNIT 5,75 RIVER ROAD,BARKING,GREATER LONDON,,IG11 0DR,21039090,Miscellaneous edible preparations,"Sauces and preparations therefor, mixed condiments and mixed seasonings (excl. soya sauce, tomato ketchup and other tomato sauces, liquid mango chutney and aromatic bitters of subheading 2103.90.30)",Import,4,2024
ACT FORWARDING & LOGISTICS LTD,34 SEA LANE,MIDDLETON-ON-SEA,BOGNOR REGIS,WEST SUSSEX,,PO22 7RT,21039090,Miscellaneous edible preparations,"Sauces and preparations therefor, mixed condiments and mixed seasonings (excl. soya sauce, tomato ketchup and other tomato sauces, liquid mango chutney and aromatic bitters of subheading 2103.90.30)",Export,4,2024
ADAM INTERNATIONAL LTD,104 ABERCORN STREET,PAISLEY,RENFREWSHIRE,,,PA3 4AY,21039090,Miscellaneous edible preparations,"Sauces and preparations therefor, mixed condiments and mixed seasonings (excl. soya sauce, tomato ketchup and other tomato sauces, liquid mango chutney and aromatic bitters of subheading 2103.90.30)",Import,2,2024
ADELEYE OLUYEMISI,FLAT 1 655 RAINHAM ROAD SOUTH,,DAGENHAM,,,RM10 8UX,21039090,Miscellaneous edible preparations,"Sauces and preparations therefor, mixed condiments and mixed seasonings (excl. soya sauce, tomato ketchup and other tomato sauces, liquid mango chutney and aromatic bitters of subheading 2103.90.30)",Import,3,2024
ADENIKE BOLANLE,30 LINDRIDGE ROAD,BIRMINGHAM,,,,B23 7HU,21039090,Miscellaneous edible preparations,"Sauces and preparations therefor, mixed condiments and mixed seasonings (excl. soya sauce, tomato ketchup and other tomato sauces, liquid mango chutney and aromatic bitters of subheading 2103.90.30)",Import,4,2024
ADES LTD,HM REVENUE AND CUSTOMS,RUBY HOUSE,8 RUBY PLACE,ABERDEEN,,AB10 1ZP,21039090,Miscellaneous edible preparations,"Sauces and preparations therefor, mixed condiments and mixed seasonings (excl. soya sauce, tomato ketchup and other tomato sauces, liquid mango chutney and aromatic bitters of subheading 2103.90.30)",Import,1,2024
ADESINA AJAO,351 CHIPPERFIELD ROAD,ORPINGTON,,,,BR5 2LJ,21039090,Miscellaneous edible preparations,"Sauces and preparations therefor, mixed condiments and mixed seasonings (excl. soya sauce, tomato ketchup and other tomato sauces, liquid mango chutney and aromatic bitters of subheading 2103.90.30)",Import,1,2024
ADUGS FOODS LIMITED,UNIT 2,LETTS ROAD,FAR COTTON,NORTHAMPTON,,NN4 8HQ,21039090,Miscellaneous edible preparations,"Sauces and preparations therefor, mixed condiments and mixed seasonings (excl. soya sauce, tomato ketchup and other tomato sauces, liquid mango chutney and aromatic bitters of subheading 2103.90.30)",Import,1,2024
ADUGS FOODS LIMITED,UNIT 2,LETTS ROAD,FAR COTTON,NORTHAMPTON,,NN4 8HQ,21039090,Miscellaneous edible preparations,"Sauces and preparations therefor, mixed condiments and mixed seasonings (excl. soya sauce, tomato ketchup and other tomato sauces, liquid mango chutney and aromatic bitters of subheading 2103.90.30)",Import,2,2024
ADUGS FOODS LIMITED,UNIT 2,LETTS ROAD,FAR COTTON,NORTHAMPTON,,NN4 8HQ,21039090,Miscellaneous edible preparations,"Sauces and preparations therefor, mixed condiments and mixed seasonings (excl. soya sauce, tomato ketchup and other tomato sauces, liquid mango chutney and aromatic bitters of subheading 2103.90.30)",Import,3,2024
ADUGS FOODS LIMITED,UNIT 2,LETTS ROAD,FAR COTTON,NORTHAMPTON,,NN4 8HQ,21039090,Miscellaneous edible preparations,"Sauces and preparations therefor, mixed condiments and mixed seasonings (excl. soya sauce, tomato ketchup and other tomato sauces, liquid mango chutney and aromatic bitters of subheading 2103.90.30)",Import,4,2024
AFAK TRADING LTD,UNIT 11,DUDDESTON MILL TRADING EST,DUDDESTON MILL ROAD,BIRMINGHAM,,B8 1AP,21039090,Miscellaneous edible preparations,"Sauces and preparations therefor, mixed condiments and mixed seasonings (excl. soya sauce, tomato ketchup and other tomato sauces, liquid mango chutney and aromatic bitters of subheading 2103.90.30)",Import,2,2024
AGA FOOD LTD,UNIT A CANALSIDE,JOHN GILBERT WAY,TRAFFORD PARK,MANCHESTER,,M17 1AH,21039090,Miscellaneous edible preparations,"Sauces and preparations therefor, mixed condiments and mixed seasonings (excl. soya sauce, tomato ketchup and other tomato sauces, liquid mango chutney and aromatic bitters of subheading 2103.90.30)",Import,1,2024
AGA FOOD LTD,UNIT A CANALSIDE,JOHN GILBERT WAY,TRAFFORD PARK,MANCHESTER,,M17 1AH,21039090,Miscellaneous edible preparations,"Sauces and preparations therefor, mixed condiments and mixed seasonings (excl. soya sauce, tomato ketchup and other tomato sauces, liquid mango chutney and aromatic bitters of subheading 2103.90.30)",Import,2,2024
AGO VENTURES LIMITED,34 CROFTMEADOW COURT,NORTHAMPTON,,,,NN3 8QA,21039090,Miscellaneous edible preparations,"Sauces and preparations therefor, mixed condiments and mixed seasonings (excl. soya sauce, tomato ketchup and other tomato sauces, liquid mango chutney and aromatic bitters of subheading 2103.90.30)",Import,1,2024